Reaction Details
TargetMacrophage metalloelastase
LigandBDBM50215926
Substrate/Competitorn/a
Meas. Tech.ChEMBL_1515860 (CHEMBL3614723)
IC50 3660±n/a nM
Citation Dyminska, L Imidazopyridines as a source of biological activity and their pharmacological potentials-Infrared and Raman spectroscopic evidence of their content in pharmaceuticals and plant materials. Bioorg Med Chem23:6087-99 (2015) 
 
Macrophage metalloelastase
Name:Macrophage metalloelastase
Type:Enzyme
Mol. Mass.:54012.99
Organism:Homo sapiens (Human)
Description:P39900
Residue:470
BDBM50215926
NameBDBM50215926
Synonyms:4-(4,5-dibromo-1H-pyrrol-2-yl)-1H-imidazo[4,5-c]pyridin-2-amine CHEMBL230806
TypeSmall organic molecule
Emp. Form.C10H7Br2N5
Mol. Mass.357.004
SMILESNc1nc2c(nccc2[nH]1)-c1cc(Br)c(Br)[nH]1