Reaction Details
TargetCarbonic anhydrase 1
LigandBDBM50118207
Substrate/Competitorn/a
Meas. Tech.ChEMBL_1514779 (CHEMBL3615101)
Ki 528±n/a nM
Citation Rankin, GMVullo, DSupuran, CTPoulsen, SA Phosphate Chemical Probes Designed for Location Specific Inhibition of Intracellular Carbonic Anhydrases. J Med Chem58:7580-90 (2015) 
 
Carbonic anhydrase 1
Name:Carbonic anhydrase 1
Type:Enzyme
Mol. Mass.:28873.37
Organism:Homo sapiens (Human)
Description:P00915
Residue:261
BDBM50118207
NameBDBM50118207
Synonyms:CHEMBL3613284
TypeSmall organic molecule
Emp. Form.C34H49N4O15PS3
Mol. Mass.880.939
SMILESCC(=O)O[C@@H]1[C@@H](COP(=O)(OCCSC(=O)C(C)(C)C)OCCSC(=O)C(C)(C)C)O[C@H]([C@H](OC(C)=O)[C@H]1OC(C)=O)n1cc(nn1)-c1ccc(cc1)S(N)(=O)=O