Reaction Details
TargetSodium channel protein type 5 subunit alpha
LigandBDBM50118513
Substrate/Competitorn/a
Meas. Tech.ChEMBL_1516901 (CHEMBL3618954)
IC50 7200±n/a nM
Citation de Lera Ruiz, MKraus, RL Voltage-Gated Sodium Channels: Structure, Function, Pharmacology, and Clinical Indications. J Med Chem58:7093-118 (2015) 
 
Sodium channel protein type 5 subunit alpha
Name:Sodium channel protein type 5 subunit alpha
Type:Enzyme
Mol. Mass.:226908.60
Organism:Homo sapiens (Human)
Description:Q14524
Residue:2016
BDBM50118513
NameBDBM50118513
Synonyms:CHEMBL3617065 | US10071957, Example 6
TypeSmall organic molecule
Emp. Form.C17H18Cl2FN3O5S
Mol. Mass.466.311
SMILESCNS(=O)(=O)NC(=O)c1cc(Cl)c(Oc2cnc(OCC(C)C)c(Cl)c2)cc1F