Reaction Details
TargetSodium channel protein type 5 subunit alpha
LigandBDBM50118514
Substrate/Competitorn/a
Meas. Tech.ChEMBL_1516901 (CHEMBL3618954)
IC50>10000±n/a nM
Citation de Lera Ruiz, MKraus, RL Voltage-Gated Sodium Channels: Structure, Function, Pharmacology, and Clinical Indications. J Med Chem58:7093-118 (2015) 
 
Sodium channel protein type 5 subunit alpha
Name:Sodium channel protein type 5 subunit alpha
Type:Enzyme
Mol. Mass.:226908.60
Organism:Homo sapiens (Human)
Description:Q14524
Residue:2016
BDBM50118514
NameBDBM50118514
Synonyms:CHEMBL3617063 | US9481677, 38
TypeSmall organic molecule
Emp. Form.C21H13ClF2N6O3S2
Mol. Mass.534.946
SMILESNc1nc2cc(ccc2[nH]1)-c1cc(Cl)ccc1Oc1cc(F)c(cc1F)S(=O)(=O)Nc1ncns1