Reaction Details
TargetSodium channel protein type 5 subunit alpha
LigandBDBM50118515
Substrate/Competitorn/a
Meas. Tech.ChEMBL_1516901 (CHEMBL3618954)
IC50>10000±n/a nM
Citation de Lera Ruiz, MKraus, RL Voltage-Gated Sodium Channels: Structure, Function, Pharmacology, and Clinical Indications. J Med Chem58:7093-118 (2015) 
 
Sodium channel protein type 5 subunit alpha
Name:Sodium channel protein type 5 subunit alpha
Type:Enzyme
Mol. Mass.:226908.60
Organism:Homo sapiens (Human)
Description:Q14524
Residue:2016
BDBM50118515
NameBDBM50118515
Synonyms:CHEMBL3617062
TypeSmall organic molecule
Emp. Form.C20H18ClF3N4O3S2
Mol. Mass.518.96
SMILESFc1cc(ccc1Cl)[C@@H]1CCNC[C@H]1COc1cc(F)c(cc1F)S(=O)(=O)Nc1ncns1