Reaction Details
TargetSodium channel protein type 5 subunit alpha
LigandBDBM50118519
Substrate/Competitorn/a
Meas. Tech.ChEMBL_1516883 (CHEMBL3618799)
IC50 0.280±n/a nM
Citation de Lera Ruiz, MKraus, RL Voltage-Gated Sodium Channels: Structure, Function, Pharmacology, and Clinical Indications. J Med Chem58:7093-118 (2015) 
 
Sodium channel protein type 5 subunit alpha
Name:Sodium channel protein type 5 subunit alpha
Type:Enzyme
Mol. Mass.:226908.60
Organism:Homo sapiens (Human)
Description:Q14524
Residue:2016
BDBM50118519
NameBDBM50118519
Synonyms:CHEMBL3617050
TypeSmall organic molecule
Emp. Form.C16H24N8O12S
Mol. Mass.552.473
SMILES[H][C@@]12C[C@]3(CN4C(=N)N[C@@]([H])(C(=O)N1OC[C@@H]2CO)[C@]1([H])N(COC(=O)NO)C(=N)N[C@]41C3(O)O)OS(O)(=O)=O