Reaction Details
TargetHistone deacetylase 6
LigandBDBM50014161
Substrate/Competitorn/a
Meas. Tech.ChEMBL_1518394 (CHEMBL3620704)
IC50 8800±n/a nM
Citation Muthyala, RShin, WSXie, JSham, YY Discovery of 1-hydroxypyridine-2-thiones as selective histone deacetylase inhibitors and their potential application for treating leukemia. Bioorg Med Chem Lett25:4320-4 (2015) 
 
Histone deacetylase 6
Name:Histone deacetylase 6
Type:Chromatin regulator; hydrolase; repressor
Mol. Mass.:131381.51
Organism:Homo sapiens (Human)
Description:Q9UBN7
Residue:1215
BDBM50014161
NameBDBM50014161
Synonyms:CHEMBL3260858 | US11491146, Compound 5
TypeSmall organic molecule
Emp. Form.C14H12N2O4S
Mol. Mass.304.321
SMILESOC(=O)[C@H](NC(=O)c1cccc(=S)n1O)c1ccccc1