Reaction Details
TargetHistone deacetylase 5
LigandBDBM50005711
Substrate/Competitorn/a
Meas. Tech.ChEMBL_1518398 (CHEMBL3620708)
IC50 1400±n/a nM
Citation Muthyala, RShin, WSXie, JSham, YY Discovery of 1-hydroxypyridine-2-thiones as selective histone deacetylase inhibitors and their potential application for treating leukemia. Bioorg Med Chem Lett25:4320-4 (2015) 
 
Histone deacetylase 5
Name:Histone deacetylase 5
Type:Enzyme
Mol. Mass.:121968.61
Organism:Homo sapiens (Human)
Description:Q9UQL6
Residue:1122
BDBM50005711
NameBDBM50005711
Synonyms:CHEBI:46024 TRICHOSTATIN Trichostatin A (TSA) US10722597, Compound Trichostatin US20230322747, Compound trichostatin A | US9265734, TSA
TypeSmall organic molecule
Emp. Form.C17H22N2O3
Mol. Mass.302.3682
SMILESC[C@H](\C=C(/C)\C=C\C(=O)NO)C(=O)c1ccc(cc1)N(C)C