Reaction Details
TargetHistone deacetylase 9
LigandBDBM50119287
Substrate/Competitorn/a
Meas. Tech.ChEMBL_1518400 (CHEMBL3620825)
IC50 47000±n/a nM
Citation Muthyala, RShin, WSXie, JSham, YY Discovery of 1-hydroxypyridine-2-thiones as selective histone deacetylase inhibitors and their potential application for treating leukemia. Bioorg Med Chem Lett25:4320-4 (2015) 
 
Histone deacetylase 9
Name:Histone deacetylase 9
Type:Enzyme
Mol. Mass.:111304.31
Organism:Homo sapiens (Human)
Description:Q9UKV0
Residue:1011
BDBM50119287
NameBDBM50119287
Synonyms:CHEMBL3617543
TypeSmall organic molecule
Emp. Form.C6H5NO3S
Mol. Mass.171.174
SMILESOC(=O)c1cccc(=S)n1O