Reaction Details
TargetProto-oncogene tyrosine-protein kinase Src
LigandBDBM50119567
Substrate/Competitorn/a
Meas. Tech.ChEMBL_1517133 (CHEMBL3619916)
Ki 130±n/a nM
Citation Kwarcinski, FESteffey, MEFox, CCSoellner, MB Discovery of Bivalent Kinase Inhibitors via Enzyme-Templated Fragment Elaboration. ACS Med Chem Lett6:898-901 (2015) 
 
Proto-oncogene tyrosine-protein kinase Src
Name:Proto-oncogene tyrosine-protein kinase Src
Type:Protein
Mol. Mass.:59838.60
Organism:Homo sapiens (Human)
Description:P12931
Residue:536
BDBM50119567
NameBDBM50119567
Synonyms:CHEMBL3617740
TypeSmall organic molecule
Emp. Form.C29H34N8O3
Mol. Mass.542.6321
SMILESC[C@@H](NC(=O)CCCCCC(=O)Nc1cccc(Nc2nccc(Nc3cc([nH]n3)C3CC3)n2)c1)c1ccco1