Reaction Details
TargetTyrosine-protein kinase ABL1
LigandBDBM50119567
Substrate/Competitorn/a
Meas. Tech.ChEMBL_1517137 (CHEMBL3619920)
Ki 1200±n/a nM
Citation Kwarcinski, FESteffey, MEFox, CCSoellner, MB Discovery of Bivalent Kinase Inhibitors via Enzyme-Templated Fragment Elaboration. ACS Med Chem Lett6:898-901 (2015) 
 
Tyrosine-protein kinase ABL1
Name:Tyrosine-protein kinase ABL1
Type:Enzyme
Mol. Mass.:122897.30
Organism:Homo sapiens (Human)
Description:P00519
Residue:1130
BDBM50119567
NameBDBM50119567
Synonyms:CHEMBL3617740
TypeSmall organic molecule
Emp. Form.C29H34N8O3
Mol. Mass.542.6321
SMILESC[C@@H](NC(=O)CCCCCC(=O)Nc1cccc(Nc2nccc(Nc3cc([nH]n3)C3CC3)n2)c1)c1ccco1