Reaction Details
TargetPhosphatidylinositol 4,5-bisphosphate 3-kinase catalytic subunit alpha isoform
LigandBDBM50119613
Substrate/Competitorn/a
Meas. Tech.ChEMBL_1517784 (CHEMBL3620380)
Ki 5.6±n/a nM
Citation Stec, MMAndrews, KLBo, YCaenepeel, SLiao, HMcCarter, JMullady, ELSan Miguel, TSubramanian, RTamayo, NWhittington, DAWang, LWu, TZalameda, LPZhang, NHughes, PENorman, MH The imidazo[1,2-a]pyridine ring system as a scaffold for potent dual phosphoinositide-3-kinase (PI3K)/mammalian target of rapamycin (mTOR) inhibitors. Bioorg Med Chem Lett25:4136-42 (2015) 
 
Phosphatidylinositol 4,5-bisphosphate 3-kinase catalytic subunit alpha isoform
Name:Phosphatidylinositol 4,5-bisphosphate 3-kinase catalytic subunit alpha isoform
Type:Enzyme Subunit
Mol. Mass.:124294.87
Organism:Homo sapiens (Human)
Description:P42336
Residue:1068
BDBM50119613
NameBDBM50119613
Synonyms:CHEMBL3618237
TypeSmall organic molecule
Emp. Form.C18H15N9
Mol. Mass.357.372
SMILESCc1nc(N)nc(n1)-c1c(Nc2cccc3[nH]ncc23)nc2ccccn12