Reaction Details
TargetSerine/threonine-protein kinase mTOR
LigandBDBM50119609
Substrate/Competitorn/a
Meas. Tech.ChEMBL_1517785 (CHEMBL3620381)
IC50 198±n/a nM
Citation Stec, MMAndrews, KLBo, YCaenepeel, SLiao, HMcCarter, JMullady, ELSan Miguel, TSubramanian, RTamayo, NWhittington, DAWang, LWu, TZalameda, LPZhang, NHughes, PENorman, MH The imidazo[1,2-a]pyridine ring system as a scaffold for potent dual phosphoinositide-3-kinase (PI3K)/mammalian target of rapamycin (mTOR) inhibitors. Bioorg Med Chem Lett25:4136-42 (2015) 
 
Serine/threonine-protein kinase mTOR
Name:Serine/threonine-protein kinase mTOR
Type:Rapamycin target protein
Mol. Mass.:288917.12
Organism:Homo sapiens (Human)
Description:P42345
Residue:2549
BDBM50119609
NameBDBM50119609
Synonyms:CHEMBL3618233
TypeSmall organic molecule
Emp. Form.C17H15FN8O
Mol. Mass.366.3524
SMILESCOc1ncc(Nc2nc3ccccn3c2-c2nc(C)nc(N)n2)cc1F