Reaction Details
TargetSerine/threonine-protein kinase mTOR
LigandBDBM50119614
Substrate/Competitorn/a
Meas. Tech.ChEMBL_1517785 (CHEMBL3620381)
IC50 62±n/a nM
Citation Stec, MMAndrews, KLBo, YCaenepeel, SLiao, HMcCarter, JMullady, ELSan Miguel, TSubramanian, RTamayo, NWhittington, DAWang, LWu, TZalameda, LPZhang, NHughes, PENorman, MH The imidazo[1,2-a]pyridine ring system as a scaffold for potent dual phosphoinositide-3-kinase (PI3K)/mammalian target of rapamycin (mTOR) inhibitors. Bioorg Med Chem Lett25:4136-42 (2015) 
 
Serine/threonine-protein kinase mTOR
Name:Serine/threonine-protein kinase mTOR
Type:Rapamycin target protein
Mol. Mass.:288917.12
Organism:Homo sapiens (Human)
Description:P42345
Residue:2549
BDBM50119614
NameBDBM50119614
Synonyms:CHEMBL3618238
TypeSmall organic molecule
Emp. Form.C21H23FN10O
Mol. Mass.450.4721
SMILESCOc1ncc(Nc2nc3ccc(cn3c2-c2nc(C)nc(N)n2)N2CCNCC2)cc1F