Reaction Details
TargetSerine/threonine-protein kinase mTOR
LigandBDBM50119617
Substrate/Competitorn/a
Meas. Tech.ChEMBL_1517785 (CHEMBL3620381)
IC50 121±n/a nM
Citation Stec, MMAndrews, KLBo, YCaenepeel, SLiao, HMcCarter, JMullady, ELSan Miguel, TSubramanian, RTamayo, NWhittington, DAWang, LWu, TZalameda, LPZhang, NHughes, PENorman, MH The imidazo[1,2-a]pyridine ring system as a scaffold for potent dual phosphoinositide-3-kinase (PI3K)/mammalian target of rapamycin (mTOR) inhibitors. Bioorg Med Chem Lett25:4136-42 (2015) 
 
Serine/threonine-protein kinase mTOR
Name:Serine/threonine-protein kinase mTOR
Type:Rapamycin target protein
Mol. Mass.:288917.12
Organism:Homo sapiens (Human)
Description:P42345
Residue:2549
BDBM50119617
NameBDBM50119617
Synonyms:CHEMBL3618241
TypeSmall organic molecule
Emp. Form.C24H29FN10O2
Mol. Mass.508.5513
SMILESCOCCN1CCN(CC1)c1ccc2nc(Nc3cnc(OC)c(F)c3)c(-c3nc(C)nc(N)n3)n2c1