Reaction Details
TargetSerine/threonine-protein kinase mTOR
LigandBDBM50119618
Substrate/Competitorn/a
Meas. Tech.ChEMBL_1517785 (CHEMBL3620381)
IC50 34±n/a nM
Citation Stec, MMAndrews, KLBo, YCaenepeel, SLiao, HMcCarter, JMullady, ELSan Miguel, TSubramanian, RTamayo, NWhittington, DAWang, LWu, TZalameda, LPZhang, NHughes, PENorman, MH The imidazo[1,2-a]pyridine ring system as a scaffold for potent dual phosphoinositide-3-kinase (PI3K)/mammalian target of rapamycin (mTOR) inhibitors. Bioorg Med Chem Lett25:4136-42 (2015) 
 
Serine/threonine-protein kinase mTOR
Name:Serine/threonine-protein kinase mTOR
Type:Rapamycin target protein
Mol. Mass.:288917.12
Organism:Homo sapiens (Human)
Description:P42345
Residue:2549
BDBM50119618
NameBDBM50119618
Synonyms:CHEMBL3618242
TypeSmall organic molecule
Emp. Form.C24H29N11O2
Mol. Mass.503.5596
SMILESCOc1ccc(Nc2nc3ccc(cn3c2-c2nc(C)nc(N)n2)N2CCN(CC2)C(=O)N(C)C)cn1