Reaction Details
TargetPhosphatidylinositol 4,5-bisphosphate 3-kinase catalytic subunit alpha isoform
LigandBDBM50119606
Substrate/Competitorn/a
Meas. Tech.ChEMBL_1517786 (CHEMBL3620382)
IC50 40±n/a nM
Citation Stec, MMAndrews, KLBo, YCaenepeel, SLiao, HMcCarter, JMullady, ELSan Miguel, TSubramanian, RTamayo, NWhittington, DAWang, LWu, TZalameda, LPZhang, NHughes, PENorman, MH The imidazo[1,2-a]pyridine ring system as a scaffold for potent dual phosphoinositide-3-kinase (PI3K)/mammalian target of rapamycin (mTOR) inhibitors. Bioorg Med Chem Lett25:4136-42 (2015) 
 
Phosphatidylinositol 4,5-bisphosphate 3-kinase catalytic subunit alpha isoform
Name:Phosphatidylinositol 4,5-bisphosphate 3-kinase catalytic subunit alpha isoform
Type:Enzyme Subunit
Mol. Mass.:124294.87
Organism:Homo sapiens (Human)
Description:P42336
Residue:1068
BDBM50119606
NameBDBM50119606
Synonyms:CHEMBL3618231
TypeSmall organic molecule
Emp. Form.C17H16N8O
Mol. Mass.348.3619
SMILESCOc1ccc(Nc2nc3ccccn3c2-c2nc(C)nc(N)n2)cn1