Reaction Details
TargetPhosphatidylinositol 4,5-bisphosphate 3-kinase catalytic subunit alpha isoform
LigandBDBM50119617
Substrate/Competitorn/a
Meas. Tech.ChEMBL_1517786 (CHEMBL3620382)
IC50 26±n/a nM
Citation Stec, MMAndrews, KLBo, YCaenepeel, SLiao, HMcCarter, JMullady, ELSan Miguel, TSubramanian, RTamayo, NWhittington, DAWang, LWu, TZalameda, LPZhang, NHughes, PENorman, MH The imidazo[1,2-a]pyridine ring system as a scaffold for potent dual phosphoinositide-3-kinase (PI3K)/mammalian target of rapamycin (mTOR) inhibitors. Bioorg Med Chem Lett25:4136-42 (2015) 
 
Phosphatidylinositol 4,5-bisphosphate 3-kinase catalytic subunit alpha isoform
Name:Phosphatidylinositol 4,5-bisphosphate 3-kinase catalytic subunit alpha isoform
Type:Enzyme Subunit
Mol. Mass.:124294.87
Organism:Homo sapiens (Human)
Description:P42336
Residue:1068
BDBM50119617
NameBDBM50119617
Synonyms:CHEMBL3618241
TypeSmall organic molecule
Emp. Form.C24H29FN10O2
Mol. Mass.508.5513
SMILESCOCCN1CCN(CC1)c1ccc2nc(Nc3cnc(OC)c(F)c3)c(-c3nc(C)nc(N)n3)n2c1