Reaction Details
TargetPoly(A)-specific ribonuclease PARN
LigandBDBM50119716
Substrate/Competitorn/a
Meas. Tech.ChEMBL_1518115 (CHEMBL3619398)
IC50 23900±n/a nM
Citation Jadhav, GPKaur, IMaryati, MAirhihen, BFischer, PMWinkler, GS Discovery, synthesis and biochemical profiling of purine-2,6-dione derivatives as inhibitors of the human poly(A)-selective ribonuclease Caf1. Bioorg Med Chem Lett25:4219-24 (2015) 
 
Poly(A)-specific ribonuclease PARN
Name:Poly(A)-specific ribonuclease PARN
Type:Enzyme
Mol. Mass.:73446.57
Organism:Homo sapiens (Human)
Description:O95453
Residue:639
BDBM50119716
NameBDBM50119716
Synonyms:CHEMBL3616525
TypeSmall organic molecule
Emp. Form.C18H23N5O3
Mol. Mass.357.4069
SMILESCN(C)CCCn1c2ncn(CCc3ccccc3)c2c(=O)n(O)c1=O