Reaction Details
TargetPoly(A)-specific ribonuclease PARN
LigandBDBM50119655
Substrate/Competitorn/a
Meas. Tech.ChEMBL_1518115 (CHEMBL3619398)
IC50 125000±n/a nM
Citation Jadhav, GPKaur, IMaryati, MAirhihen, BFischer, PMWinkler, GS Discovery, synthesis and biochemical profiling of purine-2,6-dione derivatives as inhibitors of the human poly(A)-selective ribonuclease Caf1. Bioorg Med Chem Lett25:4219-24 (2015) 
 
Poly(A)-specific ribonuclease PARN
Name:Poly(A)-specific ribonuclease PARN
Type:Enzyme
Mol. Mass.:73446.57
Organism:Homo sapiens (Human)
Description:O95453
Residue:639
BDBM50119655
NameBDBM50119655
Synonyms:CHEMBL3616508
TypeSmall organic molecule
Emp. Form.C11H9N5O3
Mol. Mass.259.2209
SMILESOn1c(=O)[nH]c2ncn(Cc3cccnc3)c2c1=O