Reaction Details
TargetPoly(A)-specific ribonuclease PARN
LigandBDBM50119651
Substrate/Competitorn/a
Meas. Tech.ChEMBL_1518115 (CHEMBL3619398)
IC50 84100±n/a nM
Citation Jadhav, GPKaur, IMaryati, MAirhihen, BFischer, PMWinkler, GS Discovery, synthesis and biochemical profiling of purine-2,6-dione derivatives as inhibitors of the human poly(A)-selective ribonuclease Caf1. Bioorg Med Chem Lett25:4219-24 (2015) 
 
Poly(A)-specific ribonuclease PARN
Name:Poly(A)-specific ribonuclease PARN
Type:Enzyme
Mol. Mass.:73446.57
Organism:Homo sapiens (Human)
Description:O95453
Residue:639
BDBM50119651
NameBDBM50119651
Synonyms:CHEMBL3616505
TypeSmall organic molecule
Emp. Form.C12H10N4O3
Mol. Mass.258.2328
SMILESOn1c(=O)[nH]c2ncn(Cc3ccccc3)c2c1=O