Reaction Details
TargetCCR4-NOT transcription complex subunit 7
LigandBDBM50119764
Substrate/Competitorn/a
Meas. Tech.ChEMBL_1518114 (CHEMBL3619397)
IC50>1000000±n/a nM
Citation Jadhav, GPKaur, IMaryati, MAirhihen, BFischer, PMWinkler, GS Discovery, synthesis and biochemical profiling of purine-2,6-dione derivatives as inhibitors of the human poly(A)-selective ribonuclease Caf1. Bioorg Med Chem Lett25:4219-24 (2015) 
 
CCR4-NOT transcription complex subunit 7
Name:CCR4-NOT transcription complex subunit 7
Type:PROTEIN
Mol. Mass.:32730.66
Organism:Homo sapiens (Human)
Description:ChEMBL_109881
Residue:285
BDBM50119764
NameBDBM50119764
Synonyms:CHEMBL3616528
TypeSmall organic molecule
Emp. Form.C12H10N4O2
Mol. Mass.242.2334
SMILESO=c1[nH]c2ncn(Cc3ccccc3)c2c(=O)[nH]1