Reaction Details
TargetCCR4-NOT transcription complex subunit 7
LigandBDBM50119877
Substrate/Competitorn/a
Meas. Tech.ChEMBL_1518114 (CHEMBL3619397)
IC50 2100±n/a nM
Citation Jadhav, GPKaur, IMaryati, MAirhihen, BFischer, PMWinkler, GS Discovery, synthesis and biochemical profiling of purine-2,6-dione derivatives as inhibitors of the human poly(A)-selective ribonuclease Caf1. Bioorg Med Chem Lett25:4219-24 (2015) 
 
CCR4-NOT transcription complex subunit 7
Name:CCR4-NOT transcription complex subunit 7
Type:PROTEIN
Mol. Mass.:32730.66
Organism:Homo sapiens (Human)
Description:ChEMBL_109881
Residue:285
BDBM50119877
NameBDBM50119877
Synonyms:CHEMBL3616517
TypeSmall organic molecule
Emp. Form.C22H22N4O3
Mol. Mass.390.4351
SMILESOn1c(=O)n(CCCc2ccccc2)c2ncn(CCc3ccccc3)c2c1=O