Reaction Details
TargetNeuronal acetylcholine receptor subunit alpha-4/beta-2
LigandBDBM50422013
Substrate/Competitorn/a
Meas. Tech.ChEMBL_1518281 (CHEMBL3620256)
Ki 5.0±n/a nM
Citation Bach, TBJensen, AAPetersen, JGSørensen, TEDella Volpe, SLiu, JBlaazer, ARvan Muijlwijk-Koezen, JEBalle, TFrølund, B Exploration of the molecular architecture of the orthosteric binding site in thea4ß2 nicotinic acetylcholine receptor with analogs of 3-(dimethylamino)butyl dimethylcarbamate (DMABC) and 1-(pyridin-3-yl)-1,4-diazepane. Eur J Med Chem102:425-44 (2015) 
 
Neuronal acetylcholine receptor subunit alpha-4/beta-2
Name:Neuronal acetylcholine receptor subunit alpha-4/beta-2
Type:Protein
Mol. Mass.:n/a
Description:n/a
Components:This complex has 2 components.
Component 1
Name:Neuronal acetylcholine receptor subunit alpha-4
Synonyms:ACHA4_HUMAN CHRNA4 protein Neuronal acetylcholine receptor protein alpha-4 subunit Nicotinic acetylcholine receptor alpha4/beta2/alpha5
Type:n/a
Mol. Mass.:69963.49
Organism:Homo sapiens (Human)
Description:NACHRA4
Residue:627
Component 2
Name:Neuronal acetylcholine receptor subunit beta-2
Synonyms:ACHB2_HUMAN Neuronal acetylcholine receptor protein beta-2 subunit | Nicotinic acetylcholine receptor alpha3/beta2/alpha5
Type:Protein
Mol. Mass.:57020.50
Organism:Homo sapiens (Human)
Description:P17787
Residue:502
BDBM50422013
NameBDBM50422013
Synonyms:LOBELINE | Lobeline Hydrochloride
TypeSmall organic molecule
Emp. Form.C22H27NO2
Mol. Mass.337.4553
SMILESCN1[C@@H](C[C@H](O)c2ccccc2)CCC[C@H]1CC(=O)c1ccccc1