Reaction Details
TargetBifunctional epoxide hydrolase 2
LigandBDBM50085551
Substrate/Competitorn/a
Meas. Tech.ChEMBL_1517874 (CHEMBL3620670)
Ki 52200±n/a nM
Citation Sun, YNKim, JHLi, WJo, ARYan, XTYang, SYKim, YH Soluble epoxide hydrolase inhibitory activity of anthraquinone components from Aloe. Bioorg Med Chem23:6659-65 (2015) 
 
Bifunctional epoxide hydrolase 2
Name:Bifunctional epoxide hydrolase 2
Type:Enzyme
Mol. Mass.:62613.07
Organism:Homo sapiens (Human)
Description:P34913
Residue:555
BDBM50085551
NameBDBM50085551
Synonyms:1,8-Dihydroxy-3-hydroxymethyl-anthraquinone CHEMBL40275 aloe-emodin | cid_10207
TypeSmall organic molecule
Emp. Form.C15H10O5
Mol. Mass.270.2369
SMILESOCc1cc(O)c2C(=O)c3c(O)cccc3C(=O)c2c1