Reaction Details
TargetBifunctional epoxide hydrolase 2
LigandBDBM50120490
Substrate/Competitorn/a
Meas. Tech.ChEMBL_1517875 (CHEMBL3620671)
Ki 2000±n/a nM
Citation Sun, YNKim, JHLi, WJo, ARYan, XTYang, SYKim, YH Soluble epoxide hydrolase inhibitory activity of anthraquinone components from Aloe. Bioorg Med Chem23:6659-65 (2015) 
 
Bifunctional epoxide hydrolase 2
Name:Bifunctional epoxide hydrolase 2
Type:Enzyme
Mol. Mass.:62613.07
Organism:Homo sapiens (Human)
Description:P34913
Residue:555
BDBM50120490
NameBDBM50120490
Synonyms:CHEMBL3617996
TypeSmall organic molecule
Emp. Form.C27H32O13
Mol. Mass.564.5352
SMILES[H][C@]1(O[C@H](CO)[C@@H](O)[C@H](O)[C@H]1O)[C@]1([H])c2cccc(O)c2C(=O)c2c(O)cc(CO[C@@H]3O[C@@H](C)[C@H](O)[C@@H](O)[C@H]3O)cc12