Reaction Details
TargetMyosin light chain kinase, smooth muscle
LigandBDBM50120593
Substrate/Competitorn/a
Meas. Tech.ChEMBL_1518061 (CHEMBL3619062)
IC50 7370±n/a nM
Citation Chikhale, RThorat, SPant, AJadhav, AThatipamula, KCBansode, RBhargavi, GKarodia, NRajasekharan, MVParadkar, AKhedekar, P Design, synthesis and pharmacological evaluation of pyrimidobenzothiazole-3-carboxylate derivatives as selective L-type calcium channel blockers. Bioorg Med Chem23:6689-713 (2015) 
 
Myosin light chain kinase, smooth muscle
Name:Myosin light chain kinase, smooth muscle
Type:Protein
Mol. Mass.:210702.56
Organism:Homo sapiens (Human)
Description:Q15746
Residue:1914
BDBM50120593
NameBDBM50120593
Synonyms:CHEMBL3618299
TypeSmall organic molecule
Emp. Form.C22H23N3OS
Mol. Mass.377.503
SMILESCCC(=O)C1=C(C)N=C2Sc3ccccc3N2C1c1ccc(cc1)N(C)C