Reaction Details
TargetMyosin light chain kinase, smooth muscle
LigandBDBM50120611
Substrate/Competitorn/a
Meas. Tech.ChEMBL_1518061 (CHEMBL3619062)
IC50 19600000±n/a nM
Citation Chikhale, RThorat, SPant, AJadhav, AThatipamula, KCBansode, RBhargavi, GKarodia, NRajasekharan, MVParadkar, AKhedekar, P Design, synthesis and pharmacological evaluation of pyrimidobenzothiazole-3-carboxylate derivatives as selective L-type calcium channel blockers. Bioorg Med Chem23:6689-713 (2015) 
 
Myosin light chain kinase, smooth muscle
Name:Myosin light chain kinase, smooth muscle
Type:Protein
Mol. Mass.:210702.56
Organism:Homo sapiens (Human)
Description:Q15746
Residue:1914
BDBM50120611
NameBDBM50120611
Synonyms:CHEMBL558858
TypeSmall organic molecule
Emp. Form.C25H30N2O5
Mol. Mass.438.5161
SMILESCCOC(=O)C1=C(C)NC(OC)N(CC(=O)c2ccc(OC)cc2)C1c1ccc(C)cc1