Reaction Details
TargetMyosin light chain kinase, smooth muscle
LigandBDBM50120587
Substrate/Competitorn/a
Meas. Tech.ChEMBL_1518061 (CHEMBL3619062)
IC50 23700000±n/a nM
Citation Chikhale, RThorat, SPant, AJadhav, AThatipamula, KCBansode, RBhargavi, GKarodia, NRajasekharan, MVParadkar, AKhedekar, P Design, synthesis and pharmacological evaluation of pyrimidobenzothiazole-3-carboxylate derivatives as selective L-type calcium channel blockers. Bioorg Med Chem23:6689-713 (2015) 
 
Myosin light chain kinase, smooth muscle
Name:Myosin light chain kinase, smooth muscle
Type:Protein
Mol. Mass.:210702.56
Organism:Homo sapiens (Human)
Description:Q15746
Residue:1914
BDBM50120587
NameBDBM50120587
Synonyms:CHEMBL3618285
TypeSmall organic molecule
Emp. Form.C19H16N2O2S
Mol. Mass.336.408
SMILESCC(=O)C1=C(C)N=C2Sc3ccccc3N2C1c1ccc(O)cc1