Reaction Details
TargetMyosin light chain kinase, smooth muscle
LigandBDBM50120590
Substrate/Competitorn/a
Meas. Tech.ChEMBL_1518061 (CHEMBL3619062)
IC50 46000000±n/a nM
Citation Chikhale, RThorat, SPant, AJadhav, AThatipamula, KCBansode, RBhargavi, GKarodia, NRajasekharan, MVParadkar, AKhedekar, P Design, synthesis and pharmacological evaluation of pyrimidobenzothiazole-3-carboxylate derivatives as selective L-type calcium channel blockers. Bioorg Med Chem23:6689-713 (2015) 
 
Myosin light chain kinase, smooth muscle
Name:Myosin light chain kinase, smooth muscle
Type:Protein
Mol. Mass.:210702.56
Organism:Homo sapiens (Human)
Description:Q15746
Residue:1914
BDBM50120590
NameBDBM50120590
Synonyms:CHEMBL3618296
TypeSmall organic molecule
Emp. Form.C21H20N2O2S
Mol. Mass.364.461
SMILESCCC(=O)C1=C(C)N=C2Sc3ccccc3N2C1c1ccc(OC)cc1