Reaction Details
Target5-hydroxytryptamine receptor 6
LigandBDBM21354
Substrate/Competitorn/a
Meas. Tech.ChEMBL_1521956 (CHEMBL3626980)
Ki 6.0±n/a nM
Citation Karila, DFreret, TBouet, VBoulouard, MDallemagne, PRochais, C Therapeutic Potential of 5-HT6 Receptor Agonists. J Med Chem58:7901-12 (2015) 
 
5-hydroxytryptamine receptor 6
Name:5-hydroxytryptamine receptor 6
Type:G Protein-Coupled Receptor (GPCR)
Mol. Mass.:46968.43
Organism:Homo sapiens (Human)
Description:P50406
Residue:440
BDBM21354
NameBDBM21354
Synonyms:2-{1-[(5-chlorothiophene-2-)sulfonyl]-1H-indol-3-yl}ethan-1-amine | thiophene sulfonyltryptamine, 11m
TypeSmall organic molecule
Emp. Form.C14H13ClN2O2S2
Mol. Mass.340.848
SMILESNCCc1cn(c2ccccc12)S(=O)(=O)c1ccc(Cl)s1