Reaction Details
Target5-hydroxytryptamine receptor 6
LigandBDBM50106250
Substrate/Competitorn/a
Meas. Tech.ChEMBL_1521952 (CHEMBL3626976)
Ki 2.9±n/a nM
Citation Karila, DFreret, TBouet, VBoulouard, MDallemagne, PRochais, C Therapeutic Potential of 5-HT6 Receptor Agonists. J Med Chem58:7901-12 (2015) 
 
5-hydroxytryptamine receptor 6
Name:5-hydroxytryptamine receptor 6
Type:G Protein-Coupled Receptor (GPCR)
Mol. Mass.:46968.43
Organism:Homo sapiens (Human)
Description:P50406
Residue:440
BDBM50106250
NameBDBM50106250
Synonyms:CHEMBL93868 [2-(1-Benzenesulfonyl-1H-indol-3-yl)-ethyl]-dimethyl-amine
TypeSmall organic molecule
Emp. Form.C18H20N2O2S
Mol. Mass.328.429
SMILESCN(C)CCc1cn(c2ccccc12)S(=O)(=O)c1ccccc1