Reaction Details
TargetOrexin/Hypocretin receptor type 1
LigandBDBM50121214
Substrate/Competitorn/a
Meas. Tech.ChEMBL_1522200 (CHEMBL3627496)
Ki 140±n/a nM
Citation Nagahara, TSaitoh, TKutsumura, NIrukayama-Tomobe, YOgawa, YKuroda, DGouda, HKumagai, HFujii, HYanagisawa, MNagase, H Design and Synthesis of Non-Peptide, Selective Orexin Receptor 2 Agonists. J Med Chem58:7931-7 (2015) 
 
Orexin/Hypocretin receptor type 1
Name:Orexin/Hypocretin receptor type 1
Type:Protein
Mol. Mass.:47554.50
Organism:Homo sapiens (Human)
Description:O43613
Residue:425
BDBM50121214
NameBDBM50121214
Synonyms:CHEMBL3623075
TypeSmall organic molecule
Emp. Form.C32H34N4O5S
Mol. Mass.586.701
SMILESCOc1ccc(cc1S(=O)(=O)Nc1cccc(NCCNC(=O)c2cccc(C)c2)c1)-c1cccc(c1)C(=O)N(C)C