Reaction Details
TargetD(3) dopamine receptor
LigandBDBM50121337
Substrate/Competitorn/a
Meas. Tech.ChEMBL_1522245 (CHEMBL3626474)
Ki 200±n/a nM
Citation Stucchi, MGmeiner, PHuebner, HRainoldi, GSacchetti, ASilvani, ALesma, G Multicomponent Synthesis and Biological Evaluation of a Piperazine-Based Dopamine Receptor Ligand Library. ACS Med Chem Lett6:882-7 (2015) 
 
D(3) dopamine receptor
Name:D(3) dopamine receptor
Type:n/a
Mol. Mass.:44243.43
Organism:Homo sapiens (Human)
Description:n/a
Residue:400
BDBM50121337
NameBDBM50121337
Synonyms:CHEMBL3622097
TypeSmall organic molecule
Emp. Form.C22H27BrN4
Mol. Mass.427.381
SMILESBrc1ccc(NCCN2CCN(CCc3c[nH]c4ccccc34)CC2)cc1