Reaction Details
TargetD(1A) dopamine receptor
LigandBDBM50121337
Substrate/Competitorn/a
Meas. Tech.ChEMBL_1522247 (CHEMBL3626476)
Ki 480±n/a nM
Citation Stucchi, MGmeiner, PHuebner, HRainoldi, GSacchetti, ASilvani, ALesma, G Multicomponent Synthesis and Biological Evaluation of a Piperazine-Based Dopamine Receptor Ligand Library. ACS Med Chem Lett6:882-7 (2015) 
 
D(1A) dopamine receptor
Name:D(1A) dopamine receptor
Type:Enzyme
Mol. Mass.:49303.43
Organism:Homo sapiens (Human)
Description:P21728
Residue:446
BDBM50121337
NameBDBM50121337
Synonyms:CHEMBL3622097
TypeSmall organic molecule
Emp. Form.C22H27BrN4
Mol. Mass.427.381
SMILESBrc1ccc(NCCN2CCN(CCc3c[nH]c4ccccc34)CC2)cc1