Reaction Details
TargetATP-sensitive inward rectifier potassium channel 1
LigandBDBM50121344
Substrate/Competitorn/a
Meas. Tech.ChEMBL_1522251 (CHEMBL3626480)
IC50 10.0±n/a nM
Citation Blass, B Inhibitors of the Renal Outer Medullary Potassium Channel. ACS Med Chem Lett6:831-3 (2015) 
 
ATP-sensitive inward rectifier potassium channel 1
Name:ATP-sensitive inward rectifier potassium channel 1
Type:Enzyme Catalytic Domain
Mol. Mass.:44809.08
Organism:Homo sapiens (Human)
Description:gi_223460826
Residue:391
BDBM50121344
NameBDBM50121344
Synonyms:CHEMBL3622105 | US9751881, Example 3
TypeSmall organic molecule
Emp. Form.C25H28N4O3
Mol. Mass.432.5148
SMILESCc1c2COC(=O)c2ccc1[C@@H](O)CN1CCC2(CCN(C2)c2ccc(cn2)C#N)CC1