Reaction Details
TargetCyclin-dependent kinase 2
LigandBDBM50121656
Substrate/Competitorn/a
Meas. Tech.ChEMBL_1516442 (CHEMBL3619460)
IC50 52120±n/a nM
Citation Hu, YLi, SLiu, FGeng, LShu, XZhang, J Discovery of novel nonpeptide allosteric inhibitors interrupting the interaction of CDK2/cyclin A3 by virtual screening and bioassays. Bioorg Med Chem Lett25:4069-73 (2015) 
 
Cyclin-dependent kinase 2
Name:Cyclin-dependent kinase 2
Type:Enzyme Subunit
Mol. Mass.:33938.17
Organism:Homo sapiens (Human)
Description:P24941
Residue:298
BDBM50121656
NameBDBM50121656
Synonyms:CHEMBL3616869
TypeSmall organic molecule
Emp. Form.C14H12N2O3S
Mol. Mass.288.322
SMILESCSc1ccc(\C=N\c2cc(ccc2O)[N+]([O-])=O)cc1