Reaction Details
TargetFlap endonuclease 1
LigandBDBM50121696
Substrate/Competitorn/a
Meas. Tech.ChEMBL_1516648 (CHEMBL3620428)
IC50>100000±n/a nM
Citation Chapman, TMGillen, KJWallace, CLee, MTBakrania, PKhurana, PCoombs, PJStennett, LFox, SBureau, EABrownlees, JMelton, DWSaxty, B Catechols and 3-hydroxypyridones as inhibitors of the DNA repair complex ERCC1-XPF. Bioorg Med Chem Lett25:4097-103 (2015) 
 
Flap endonuclease 1
Name:Flap endonuclease 1
Type:PROTEIN
Mol. Mass.:42602.57
Organism:Homo sapiens (Human)
Description:ChEMBL_1517026
Residue:380
BDBM50121696
NameBDBM50121696
Synonyms:CHEMBL3617001
TypeSmall organic molecule
Emp. Form.C15H14ClNO3
Mol. Mass.291.73
SMILESOc1ccc(CNC(=O)Cc2ccccc2Cl)cc1O