Reaction Details
TargetFlap endonuclease 1
LigandBDBM50121866
Substrate/Competitorn/a
Meas. Tech.ChEMBL_1517026 (CHEMBL3619485)
IC50 1100±n/a nM
Citation Chapman, TMWallace, CGillen, KJBakrania, PKhurana, PCoombs, PJFox, SBureau, EABrownlees, JMelton, DWSaxty, B N-Hydroxyimides and hydroxypyrimidinones as inhibitors of the DNA repair complex ERCC1-XPF. Bioorg Med Chem Lett25:4104-8 (2015) 
 
Flap endonuclease 1
Name:Flap endonuclease 1
Type:PROTEIN
Mol. Mass.:42602.57
Organism:Homo sapiens (Human)
Description:ChEMBL_1517026
Residue:380
BDBM50121866
NameBDBM50121866
Synonyms:CHEMBL3617198
TypeSmall organic molecule
Emp. Form.C12H13N3O3
Mol. Mass.247.2499
SMILESOn1c(=O)[nH]c2cc(ccc2c1=O)N1CCCC1