Reaction Details
TargetFlap endonuclease 1
LigandBDBM33412
Substrate/Competitorn/a
Meas. Tech.ChEMBL_1517026 (CHEMBL3619485)
IC50 300±n/a nM
Citation Chapman, TMWallace, CGillen, KJBakrania, PKhurana, PCoombs, PJFox, SBureau, EABrownlees, JMelton, DWSaxty, B N-Hydroxyimides and hydroxypyrimidinones as inhibitors of the DNA repair complex ERCC1-XPF. Bioorg Med Chem Lett25:4104-8 (2015) 
 
Flap endonuclease 1
Name:Flap endonuclease 1
Type:PROTEIN
Mol. Mass.:42602.57
Organism:Homo sapiens (Human)
Description:ChEMBL_1517026
Residue:380
BDBM33412
NameBDBM33412
Synonyms:CHEMBL183852 US11253521, No. 12
TypeSmall organic molecule
Emp. Form.C8H6N2O3
Mol. Mass.178.1448
SMILESOn1c(=O)[nH]c2ccccc2c1=O