Reaction Details
TargetFlap endonuclease 1
LigandBDBM50157830
Substrate/Competitorn/a
Meas. Tech.ChEMBL_1517026 (CHEMBL3619485)
IC50 3.0±n/a nM
Citation Chapman, TMWallace, CGillen, KJBakrania, PKhurana, PCoombs, PJFox, SBureau, EABrownlees, JMelton, DWSaxty, B N-Hydroxyimides and hydroxypyrimidinones as inhibitors of the DNA repair complex ERCC1-XPF. Bioorg Med Chem Lett25:4104-8 (2015) 
 
Flap endonuclease 1
Name:Flap endonuclease 1
Type:PROTEIN
Mol. Mass.:42602.57
Organism:Homo sapiens (Human)
Description:ChEMBL_1517026
Residue:380
BDBM50157830
NameBDBM50157830
Synonyms:3-Hydroxy-7-phenyl-1H-thieno[3,2-d]pyrimidine-2,4-dione | CHEMBL361011
TypeSmall organic molecule
Emp. Form.C12H8N2O3S
Mol. Mass.260.269
SMILESOn1c(=O)[nH]c2c(csc2c1=O)-c1ccccc1