Reaction Details
TargetFlap endonuclease 1
LigandBDBM50157846
Substrate/Competitorn/a
Meas. Tech.ChEMBL_1517026 (CHEMBL3619485)
IC50 57±n/a nM
Citation Chapman, TMWallace, CGillen, KJBakrania, PKhurana, PCoombs, PJFox, SBureau, EABrownlees, JMelton, DWSaxty, B N-Hydroxyimides and hydroxypyrimidinones as inhibitors of the DNA repair complex ERCC1-XPF. Bioorg Med Chem Lett25:4104-8 (2015) 
 
Flap endonuclease 1
Name:Flap endonuclease 1
Type:PROTEIN
Mol. Mass.:42602.57
Organism:Homo sapiens (Human)
Description:ChEMBL_1517026
Residue:380
BDBM50157846
NameBDBM50157846
Synonyms:3-Hydroxy-7-p-tolyl-1H-furo[3,2-d]pyrimidine-2,4-dione | CHEMBL182381
TypeSmall organic molecule
Emp. Form.C13H10N2O4
Mol. Mass.258.2295
SMILESCc1ccc(cc1)-c1coc2c1[nH]c(=O)n(O)c2=O