Reaction Details
TargetFlap endonuclease 1
LigandBDBM50153254
Substrate/Competitorn/a
Meas. Tech.ChEMBL_1517026 (CHEMBL3619485)
IC50 88900±n/a nM
Citation Chapman, TMWallace, CGillen, KJBakrania, PKhurana, PCoombs, PJFox, SBureau, EABrownlees, JMelton, DWSaxty, B N-Hydroxyimides and hydroxypyrimidinones as inhibitors of the DNA repair complex ERCC1-XPF. Bioorg Med Chem Lett25:4104-8 (2015) 
 
Flap endonuclease 1
Name:Flap endonuclease 1
Type:PROTEIN
Mol. Mass.:42602.57
Organism:Homo sapiens (Human)
Description:ChEMBL_1517026
Residue:380
BDBM50153254
NameBDBM50153254
Synonyms:5,6-dihydroxy-1-methyl-2-thiophen-2-yl-pyrimidine-4-carboxylic acid 5-hydroxy-1-methyl-6-oxo-2-(thiophen-2-yl)-1,6-dihydropyrimidine-4-carboxylic acid | CHEMBL366051
TypeSmall organic molecule
Emp. Form.C10H8N2O4S
Mol. Mass.252.247
SMILESCn1c(nc(C(O)=O)c(O)c1=O)-c1cccs1