Reaction Details
TargetFlap endonuclease 1
LigandBDBM50121919
Substrate/Competitorn/a
Meas. Tech.ChEMBL_1517026 (CHEMBL3619485)
IC50>100000±n/a nM
Citation Chapman, TMWallace, CGillen, KJBakrania, PKhurana, PCoombs, PJFox, SBureau, EABrownlees, JMelton, DWSaxty, B N-Hydroxyimides and hydroxypyrimidinones as inhibitors of the DNA repair complex ERCC1-XPF. Bioorg Med Chem Lett25:4104-8 (2015) 
 
Flap endonuclease 1
Name:Flap endonuclease 1
Type:PROTEIN
Mol. Mass.:42602.57
Organism:Homo sapiens (Human)
Description:ChEMBL_1517026
Residue:380
BDBM50121919
NameBDBM50121919
Synonyms:CHEMBL3617290
TypeSmall organic molecule
Emp. Form.C16H26N4O3
Mol. Mass.322.4026
SMILESCC(C)CCNC(=O)c1nc([nH]c(=O)c1O)C1CCCN(C)C1