Reaction Details
TargetFlap endonuclease 1
LigandBDBM50121921
Substrate/Competitorn/a
Meas. Tech.ChEMBL_1517026 (CHEMBL3619485)
IC50 300±n/a nM
Citation Chapman, TMWallace, CGillen, KJBakrania, PKhurana, PCoombs, PJFox, SBureau, EABrownlees, JMelton, DWSaxty, B N-Hydroxyimides and hydroxypyrimidinones as inhibitors of the DNA repair complex ERCC1-XPF. Bioorg Med Chem Lett25:4104-8 (2015) 
 
Flap endonuclease 1
Name:Flap endonuclease 1
Type:PROTEIN
Mol. Mass.:42602.57
Organism:Homo sapiens (Human)
Description:ChEMBL_1517026
Residue:380
BDBM50121921
NameBDBM50121921
Synonyms:CHEMBL1207029
TypeSmall organic molecule
Emp. Form.C12H7NO3
Mol. Mass.213.1889
SMILESON1C(=O)c2cccc3cccc(C1=O)c23