Reaction Details
TargetMetabotropic glutamate receptor 3
LigandBDBM50122253
Substrate/Competitorn/a
Meas. Tech.ChEMBL_1517378 (CHEMBL3620959)
IC50 316±n/a nM
Citation Engers, JLRodriguez, ALKonkol, LCMorrison, RDThompson, ADByers, FWBlobaum, ALChang, SVenable, DFLoch, MTNiswender, CMDaniels, JSJones, CKConn, PJLindsley, CWEmmitte, KA Discovery of a Selective and CNS Penetrant Negative Allosteric Modulator of Metabotropic Glutamate Receptor Subtype 3 with Antidepressant and Anxiolytic Activity in Rodents. J Med Chem58:7485-500 (2015) 
 
Metabotropic glutamate receptor 3
Name:Metabotropic glutamate receptor 3
Type:Protein
Mol. Mass.:98971.84
Organism:Rattus norvegicus (Rat)
Description:P31422
Residue:879
BDBM50122253
NameBDBM50122253
Synonyms:CHEMBL3617639
TypeSmall organic molecule
Emp. Form.C20H19ClN4O3
Mol. Mass.398.843
SMILESCOc1cccc(c1)N1C[C@@H](C)n2nc(COc3ccc(Cl)cn3)cc2C1=O