Reaction Details
TargetMetabotropic glutamate receptor 3
LigandBDBM50122247
Substrate/Competitorn/a
Meas. Tech.ChEMBL_1517378 (CHEMBL3620959)
IC50 280±n/a nM
Citation Engers, JLRodriguez, ALKonkol, LCMorrison, RDThompson, ADByers, FWBlobaum, ALChang, SVenable, DFLoch, MTNiswender, CMDaniels, JSJones, CKConn, PJLindsley, CWEmmitte, KA Discovery of a Selective and CNS Penetrant Negative Allosteric Modulator of Metabotropic Glutamate Receptor Subtype 3 with Antidepressant and Anxiolytic Activity in Rodents. J Med Chem58:7485-500 (2015) 
 
Metabotropic glutamate receptor 3
Name:Metabotropic glutamate receptor 3
Type:Protein
Mol. Mass.:98971.84
Organism:Rattus norvegicus (Rat)
Description:P31422
Residue:879
BDBM50122247
NameBDBM50122247
Synonyms:CHEMBL3617645
TypeSmall organic molecule
Emp. Form.C19H15ClF2N4O2
Mol. Mass.404.798
SMILESC[C@@H]1CN(C(=O)c2cc(COc3ccc(Cl)cn3)nn12)c1ccc(F)cc1F