Reaction Details
TargetMitogen-activated protein kinase kinase kinase kinase 4
LigandBDBM50122742
Substrate/Competitorn/a
Meas. Tech.ChEMBL_1519919 (CHEMBL3624922)
IC50 1.6±n/a nM
Citation Ndubaku, COCrawford, TDChen, HBoggs, JWDrobnick, JHarris, SFJesudason, RMcNamara, ENonomiya, JSambrone, ASchmidt, SSmyczek, TVitorino, PWang, LWu, PYeung, SChen, JChen, KDing, CZWang, TXu, ZGould, SEMurray, LJYe, W Structure-Based Design of GNE-495, a Potent and Selective MAP4K4 Inhibitor with Efficacy in Retinal Angiogenesis. ACS Med Chem Lett6:913-8 (2015) 
 
Mitogen-activated protein kinase kinase kinase kinase 4
Name:Mitogen-activated protein kinase kinase kinase kinase 4
Type:Serine/threonine-protein kinase
Mol. Mass.:142114.73
Organism:Homo sapiens (Human)
Description:O95819
Residue:1239
BDBM50122742
NameBDBM50122742
Synonyms:CHEMBL3623139
TypeSmall organic molecule
Emp. Form.C20H19FN6O2
Mol. Mass.394.4023
SMILESCNC(=O)N1CC(C1)NC(=O)c1cnc(N)c2nc(ccc12)-c1cccc(F)c1