Reaction Details
TargetCytochrome P450 2C19
LigandBDBM50123453
Substrate/Competitorn/a
Meas. Tech.ChEMBL_1521060 (CHEMBL3624606)
IC50>50±n/a nM
Citation Zeng, QWang, JCheng, ZChen, KJohnström, PVarnäs, KLi, DYYang, ZFZhang, X Discovery and Evaluation of Clinical Candidate AZD3759, a Potent, Oral Active, Central Nervous System-Penetrant, Epidermal Growth Factor Receptor Tyrosine Kinase Inhibitor. J Med Chem58:8200-15 (2015) 
 
Cytochrome P450 2C19
Name:Cytochrome P450 2C19
Type:Enzyme
Mol. Mass.:55935.47
Organism:Homo sapiens (Human)
Description:P33261
Residue:490
BDBM50123453
NameBDBM50123453
Synonyms:CHEMBL3623290
TypeSmall organic molecule
Emp. Form.C22H23ClFN5O3
Mol. Mass.459.901
SMILESCOc1cc2ncnc(Nc3cccc(Cl)c3F)c2cc1OC(=O)N1CCN(C)C[C@H]1C