Reaction Details
TargetRetinoic acid receptor RXR-alpha
LigandBDBM50123611
Substrate/Competitorn/a
Meas. Tech.ChEMBL_1521819 (CHEMBL3626679)
EC50 215±n/a nM
Citation Atigadda, VRXia, GDeshpande, AWu, LKedishvili, NSmith, CDKrontiras, HBland, KIGrubbs, CJBrouillette, WJMuccio, DD Conformationally Defined Rexinoids and Their Efficacy in the Prevention of Mammary Cancers. J Med Chem58:7763-74 (2015) 
 
Retinoic acid receptor RXR-alpha
Name:Retinoic acid receptor RXR-alpha
Type:PROTEIN
Mol. Mass.:50820.38
Organism:Homo sapiens (Human)
Description:ChEMBL_1456363
Residue:462
BDBM50123611
NameBDBM50123611
Synonyms:CHEMBL3622721
TypeSmall organic molecule
Emp. Form.C25H30O2
Mol. Mass.362.5045
SMILESCC(C)C1=C(CCC\C1=C/C(/C)=C\C=C\C(\C)=C\C(O)=O)c1ccccc1